DEBUG: Executing shell function do_compile
NOTE: make -j 16 -l 75 clippy-only
flex   lib/command_lex.l
bison -y -d -Dapi.prefix={cmd_yy} -Dparse.error=verbose -Wno-yacc  lib/command_parse.y
flex   lib/defun_lex.l
/usr/bin/env perl ./lib/route_types.pl --enabled babeld --enabled bfdd --enabled bgpd --enabled bgpd-vnc --enabled eigrpd --enabled isisd --enabled fabricd --enabled ldpd  --enabled ospfd --enabled ospf6d --enabled pbrd --enabled pimd --enabled ripd --enabled ripngd  --enabled zebra < ./lib/route_types.txt > lib/route_types.h
lib/command_parse.y:20.10-30: error: invalid %header file name ignored
   20 | %defines "lib/command_parse.h"
      |          ^~~~~~~~~~~~~~~~~~~~~
lib/command_parse.y:21.10-30: error: invalid %output file name ignored
   21 | %output  "lib/command_parse.c"
      |          ^~~~~~~~~~~~~~~~~~~~~
make: *** [Makefile:19379: lib/command_parse.c] Error 1
make: *** Waiting for unfinished jobs....
ERROR: oe_runmake failed
WARNING: exit code 1 from a shell command.

Error details

Submitted on:
20/10/26 03:40
Error type:
Recipe
Task:
do_compile
Recipe:
frr-native
Recipe version:
10.6.2-r0
Machine:
qemux86-64
Distro:
poky
Build system:
x86_64-linux
Target system:
x86_64-poky-linux
Host distro:
debian-12/debian-12
Branch:
yoe/mut
Commit:
deaf8dd0aeab3bc14b9ce5745a8bca4808833b90
Build:
#253286
Submitter:
yp-ab-debian12-vk-8
Link back:
https://autobuilder.yoctoproject.org/valkyrie/#/builders/81/builds/1877
Similar errors:
15
Open a bug