DEBUG: Executing shell function do_compile
NOTE: make -j 16 -l 75
make  all-recursive
make[1]: Entering directory 'TOPDIR/tmp/work/x86_64-linux/shadow-native/4.20.3/build'
Making all in lib
make[2]: Entering directory 'TOPDIR/tmp/work/x86_64-linux/shadow-native/4.20.3/build/lib'
/bin/sh ../libtool  --tag=CC   --mode=compile gcc  -std=gnu23  -I. -I../../sources/shadow-4.20.3/lib -I..    -I../../sources/shadow-4.20.3 -isystemTOPDIR/tmp/work/x86_64-linux/shadow-native/4.20.3/recipe-sysroot-native/usr/include    -isystemTOPDIR/tmp/work/x86_64-linux/shadow-native/4.20.3/recipe-sysroot-native/usr/include -O2 -pipe -c -o libshadow_la-addgrps.lo `test -f 'addgrps.c' || echo '../../sources/shadow-4.20.3/lib/'`addgrps.c
libtool: compile:  gcc -std=gnu23 -I. -I../../sources/shadow-4.20.3/lib -I.. -I../../sources/shadow-4.20.3 -isystemTOPDIR/tmp/work/x86_64-linux/shadow-native/4.20.3/recipe-sysroot-native/usr/include -isystemTOPDIR/tmp/work/x86_64-linux/shadow-native/4.20.3/recipe-sysroot-native/usr/include -O2 -pipe -c ../../sources/shadow-4.20.3/lib/addgrps.c  -fPIC -DPIC -o .libs/libshadow_la-addgrps.o
/bin/sh ../libtool  --tag=CC   --mode=compile gcc  -std=gnu23  -I. -I../../sources/shadow-4.20.3/lib -I..    -I../../sources/shadow-4.20.3 -isystemTOPDIR/tmp/work/x86_64-linux/shadow-native/4.20.3/recipe-sysroot-native/usr/include    -isystemTOPDIR/tmp/work/x86_64-linux/shadow-native/4.20.3/recipe-sysroot-native/usr/include -O2 -pipe -c -o libshadow_la-chowndir.lo `test -f 'chowndir.c' || echo '../../sources/shadow-4.20.3/lib/'`chowndir.c
libtool: compile:  gcc -std=gnu23 -I. -I../../sources/shadow-4.20.3/lib -I.. -I../../sources/shadow-4.20.3 -isystemTOPDIR/tmp/work/x86_64-linux/shadow-native/4.20.3/recipe-sysroot-native/usr/include -isystemTOPDIR/tmp/work/x86_64-linux/shadow-native/4.20.3/recipe-sysroot-native/usr/include -O2 -pipe -c ../../sources/shadow-4.20.3/lib/chowndir.c  -fPIC -DPIC -o .libs/libshadow_la-chowndir.o
/bin/sh ../libtool  --tag=CC   --mode=compile gcc  -std=gnu23  -I. -I../../sources/shadow-4.20.3/lib -I..    -I../../sources/shadow-4.20.3 -isystemTOPDIR/tmp/work/x86_64-linux/shadow-native/4.20.3/recipe-sysroot-native/usr/include    -isystemTOPDIR/tmp/work/x86_64-linux/shadow-native/4.20.3/recipe-sysroot-native/usr/include -O2 -pipe -c -o libshadow_la-chowntty.lo `test -f 'chowntty.c' || echo '../../sources/shadow-4.20.3/lib/'`chowntty.c
/bin/sh ../libtool  --tag=CC   --mode=compile gcc  -std=gnu23  -I. -I../../sources/shadow-4.20.3/lib -I..    -I../../sources/shadow-4.20.3 -isystemTOPDIR/tmp/work/x86_64-linux/shadow-native/4.20.3/recipe-sysroot-native/usr/include    -isystemTOPDIR/tmp/work/x86_64-linux/shadow-native/4.20.3/recipe-sysroot-native/usr/include -O2 -pipe -c -o libshadow_la-chkhash.lo `test -f 'chkhash.c' || echo '../../sources/shadow-4.20.3/lib/'`chkhash.c
/bin/sh ../libtool  --tag=CC   --mode=compile gcc  -std=gnu23  -I. -I../../sources/shadow-4.20.3/lib -I..    -I../../sources/shadow-4.20.3 -isystemTOPDIR/tmp/work/x86_64-linux/shadow-native/4.20.3/recipe-sysroot-native/usr/include    -isystemTOPDIR/tmp/work/x86_64-linux/shadow-native/4.20.3/recipe-sysroot-native/usr/include -O2 -pipe -c -o libshadow_la-chkname.lo `test -f 'chkname.c' || echo '../../sources/shadow-4.20.3/lib/'`chkname.c
libtool: compile:  gcc -std=gnu23 -I. -I../../sources/shadow-4.20.3/lib -I.. -I../../sources/shadow-4.20.3 -isystemTOPDIR/tmp/work/x86_64-linux/shadow-native/4.20.3/recipe-sysroot-native/usr/include -isystemTOPDIR/tmp/work/x86_64-linux/shadow-native/4.20.3/recipe-sysroot-native/usr/include -O2 -pipe -c ../../sources/shadow-4.20.3/lib/chowntty.c  -fPIC -DPIC -o .libs/libshadow_la-chowntty.o
libtool: compile:  gcc -std=gnu23 -I. -I../../sources/shadow-4.20.3/lib -I.. -I../../sources/shadow-4.20.3 -isystemTOPDIR/tmp/work/x86_64-linux/shadow-native/4.20.3/recipe-sysroot-native/usr/include -isystemTOPDIR/tmp/work/x86_64-linux/shadow-native/4.20.3/recipe-sysroot-native/usr/include -O2 -pipe -c ../../sources/shadow-4.20.3/lib/chkname.c  -fPIC -DPIC -o .libs/libshadow_la-chkname.o
libtool: compile:  gcc -std=gnu23 -I. -I../../sources/shadow-4.20.3/lib -I.. -I../../sources/shadow-4.20.3 -isystemTOPDIR/tmp/work/x86_64-linux/shadow-native/4.20.3/recipe-sysroot-native/usr/include -isystemTOPDIR/tmp/work/x86_64-linux/shadow-native/4.20.3/recipe-sysroot-native/usr/include -O2 -pipe -c ../../sources/shadow-4.20.3/lib/chkhash.c  -fPIC -DPIC -o .libs/libshadow_la-chkhash.o
/bin/sh ../libtool  --tag=CC   --mode=compile gcc  -std=gnu23  -I. -I../../sources/shadow-4.20.3/lib -I..    -I../../sources/shadow-4.20.3 -isystemTOPDIR/tmp/work/x86_64-linux/shadow-native/4.20.3/recipe-sysroot-native/usr/include    -isystemTOPDIR/tmp/work/x86_64-linux/shadow-native/4.20.3/recipe-sysroot-native/usr/include -O2 -pipe -c -o libshadow_la-cleanup_user.lo `test -f 'cleanup_user.c' || echo '../../sources/shadow-4.20.3/lib/'`cleanup_user.c
libtool: compile:  gcc -std=gnu23 -I. -I../../sources/shadow-4.20.3/lib -I.. -I../../sources/shadow-4.20.3 -isystemTOPDIR/tmp/work/x86_64-linux/shadow-native/4.20.3/recipe-sysroot-native/usr/include -isystemTOPDIR/tmp/work/x86_64-linux/shadow-native/4.20.3/recipe-sysroot-native/usr/include -O2 -pipe -c ../../sources/shadow-4.20.3/lib/cleanup_user.c  -fPIC -DPIC -o .libs/libshadow_la-cleanup_user.o
/bin/sh ../libtool  --tag=CC   --mode=compile gcc  -std=gnu23  -I. -I../../sources/shadow-4.20.3/lib -I..    -I../../sources/shadow-4.20.3 -isystemTOPDIR/tmp/work/x86_64-linux/shadow-native/4.20.3/recipe-sysroot-native/usr/include    -isystemTOPDIR/tmp/work/x86_64-linux/shadow-native/4.20.3/recipe-sysroot-native/usr/include -O2 -pipe -c -o libshadow_la-commonio.lo `test -f 'commonio.c' || echo '../../sources/shadow-4.20.3/lib/'`commonio.c
/bin/sh ../libtool  --tag=CC   --mode=compile gcc  -std=gnu23  -I. -I../../sources/shadow-4.20.3/lib -I..    -I../../sources/shadow-4.20.3 -isystemTOPDIR/tmp/work/x86_64-linux/shadow-native/4.20.3/recipe-sysroot-native/usr/include    -isystemTOPDIR/tmp/work/x86_64-linux/shadow-native/4.20.3/recipe-sysroot-native/usr/include -O2 -pipe -c -o libshadow_la-cleanup_group.lo `test -f 'cleanup_group.c' || echo '../../sources/shadow-4.20.3/lib/'`cleanup_group.c
libtool: compile:  gcc -std=gnu23 -I. -I../../sources/shadow-4.20.3/lib -I.. -I../../sources/shadow-4.20.3 -isystemTOPDIR/tmp/work/x86_64-linux/shadow-native/4.20.3/recipe-sysroot-native/usr/include -isystemTOPDIR/tmp/work/x86_64-linux/shadow-native/4.20.3/recipe-sysroot-native/usr/include -O2 -pipe -c ../../sources/shadow-4.20.3/lib/cleanup_group.c  -fPIC -DPIC -o .libs/libshadow_la-cleanup_group.o
libtool: compile:  gcc -std=gnu23 -I. -I../../sources/shadow-4.20.3/lib -I.. -I../../sources/shadow-4.20.3 -isystemTOPDIR/tmp/work/x86_64-linux/shadow-native/4.20.3/recipe-sysroot-native/usr/include -isystemTOPDIR/tmp/work/x86_64-linux/shadow-native/4.20.3/recipe-sysroot-native/usr/include -O2 -pipe -c ../../sources/shadow-4.20.3/lib/commonio.c  -fPIC -DPIC -o .libs/libshadow_la-commonio.o
../../sources/shadow-4.20.3/lib/commonio.c: In function ‘dec_lock_count’:
../../sources/shadow-4.20.3/lib/commonio.c:425:51: error: passing argument 1 of ‘nscd_flush_cache’ makes integer from pointer without a cast [-Wint-conversion]
  425 |                                 nscd_flush_cache ("passwd");
      |                                                   ^~~~~~~~
      |                                                   |
      |                                                   char *
In file included from ../../sources/shadow-4.20.3/lib/commonio.c:29:
../../sources/shadow-4.20.3/lib/nscd.h:11:35: note: expected ‘int’ but argument is of type ‘char *’
   11 | nscd_flush_cache(MAYBE_UNUSED int _1)
../../sources/shadow-4.20.3/lib/commonio.c:426:51: error: passing argument 1 of ‘nscd_flush_cache’ makes integer from pointer without a cast [-Wint-conversion]
  426 |                                 nscd_flush_cache ("group");
      |                                                   ^~~~~~~
      |                                                   |
      |                                                   char *
../../sources/shadow-4.20.3/lib/nscd.h:11:35: note: expected ‘int’ but argument is of type ‘char *’
   11 | nscd_flush_cache(MAYBE_UNUSED int _1)
make[2]: *** [Makefile:1619: libshadow_la-commonio.lo] Error 1
make[2]: *** Waiting for unfinished jobs....
make[2]: Leaving directory 'TOPDIR/tmp/work/x86_64-linux/shadow-native/4.20.3/build/lib'
make[1]: Leaving directory 'TOPDIR/tmp/work/x86_64-linux/shadow-native/4.20.3/build'
make[1]: *** [Makefile:488: all-recursive] Error 1
make: *** [Makefile:418: all] Error 2
ERROR: oe_runmake failed
WARNING: exit code 1 from a shell command.

Error details

Submitted on:
02/10/26 03:00
Error type:
Recipe
Task:
do_compile
Recipe:
shadow-native
Recipe version:
4.20.3-r0
Machine:
qemuarm
Distro:
nodistro
Build system:
x86_64-linux
Target system:
arm-oe-linux-gnueabi
Host distro:
ubuntu-25.04/ubuntu-25.04
Branch:
mathieu/master-next
Commit:
9867a16757318987bd7258dfc29771eb1f10e9c6
Build:
#252348
Submitter:
yp-ab-ubuntu2504-vk-1
Link back:
https://autobuilder.yoctoproject.org/valkyrie/#/builders/40/builds/4733
Similar errors:
3
Open a bug