DEBUG: Executing shell function do_compile
NOTE: Building/installing only 64-bit libpseudo.so for pseudo-native.
NOTE: If you need to run 32-bit executables, ensure that NO32LIBS is set to 0.
SQLite header for version 3053004 found in TOPDIR/tmp/work/x86_64-linux/pseudo-native/1.9.11+git/recipe-sysroot-native/usr.
Enabling in-memory database by default.
NOTE: make -j 16 -l 75 RPATH=-Wl,--rpath=XORIGIN/../../../sqlite3-native/usr/lib/
gcc  -c -isystemTOPDIR/tmp/work/x86_64-linux/pseudo-native/1.9.11+git/recipe-sysroot-native/usr/include -isystemTOPDIR/tmp/work/x86_64-linux/pseudo-native/1.9.11+git/recipe-sysroot-native/usr/include -O2 -pipe -pipe -std=gnu99 -Wall -W -Wextra -Wno-deprecated-declarations -fPIC -D_LARGEFILE64_SOURCE -D_ATFILE_SOURCE -isystemTOPDIR/tmp/work/x86_64-linux/pseudo-native/1.9.11+git/recipe-sysroot-native/usr/include -O2 -pipe -DPSEUDO_PREFIX='"TOPDIR/tmp/work/x86_64-linux/pseudo-native/1.9.11+git/recipe-sysroot-native/usr"' -DPSEUDO_SUFFIX='""' -DPSEUDO_BINDIR='"bin"' -DPSEUDO_LIBDIR='"lib/pseudo/lib64"' -DPSEUDO_LOCALSTATEDIR='"var/pseudo"' -DPSEUDO_VERSION='"1.99.0"' -DUSE_MEMORY_DB -DPSEUDO_FORCE_ASYNC -DPSEUDO_PASSWD_FALLBACK='NULL'   -DPSEUDO_XATTR_SUPPORT       -DPSEUDO_EPOLL -O2 -g -LTOPDIR/tmp/work/x86_64-linux/pseudo-native/1.9.11+git/recipe-sysroot-native/usr/lib -ITOPDIR/tmp/work/x86_64-linux/pseudo-native/1.9.11+git/recipe-sysroot-native/usr/include -Wl,--rpath=XORIGIN/../../../sqlite3-native/usr/lib/ pseudo_util.c
pseudo_util.c: In function ‘pseudo_get_value’:
pseudo_util.c:169:34: error: invalid suffix "D" on integer constant
  169 |         if (pseudo_util_initted =3D=3D 0 && pseudo_env[i].key &&
      |                                  ^~
pseudo_util.c:169:37: error: invalid suffix "D" on integer constant
  169 |         if (pseudo_util_initted =3D=3D 0 && pseudo_env[i].key &&
      |                                     ^~
pseudo_util.c:169:39: error: expected ‘)’ before numeric constant
  169 |         if (pseudo_util_initted =3D=3D 0 && pseudo_env[i].key &&
      |            ~                          ^~
      |                                       )
make: *** [Makefile:133: pseudo_util.o] Error 1
ERROR: oe_runmake failed
WARNING: exit code 1 from a shell command.

Error details

Submitted on:
30/09/26 08:01
Error type:
Recipe
Task:
do_compile
Recipe:
pseudo-native
Recipe version:
1.9.11+git-r0
Machine:
qemuarm64
Distro:
poky
Build system:
x86_64-linux
Target system:
aarch64-poky-linux
Host distro:
universal/debian-12
Branch:
master-next
Commit:
eb437e02522e429aa709aa38624b9aaa8c6340e9
Build:
#252248
Submitter:
yp-ab-debian12-vk-1
Link back:
https://autobuilder.yoctoproject.org/valkyrie/#/builders/14/builds/4553
Similar errors:
2
Open a bug